{"text_format":"1","workbook":"xlsx","n_sheets":5,"sheets":["Config","Tag Mapping","Assembly database","Revision","Conn Information"],"not_rendered":{"charts":0,"images":0,"macros":1,"external_links":0,"defined_names":2,"comments":0,"pivot_tables":0},"unopened":[],"bounds":{"document_bytes":16777216,"sheet_cells":100000,"rows_first":2000,"rows_last":500,"rows_between":2000,"halvings":0,"cell_chars":16384,"cell_head_chars":4096},"cells_cut":0,"cells_raw":0,"read":"whole","date_system":"1900"}

{"sheet":"Config","index":0,"n_rows":69,"n_cols":11,"rows_kept":69,"cut":false,"hidden":false,"merged":[[2,10,4,10]]}
["POINT I/O Rack",null,null,null,"Comm Format : ",{"$f":"VLOOKUP($B$3,'Conn Information'!$A$15:$B$18,2,FALSE)","v":"Data - SINT"},null,null,"Source: 1734-UM016"]
[null,null,null,null,null,"Instance","Size","Check"]
["Connection Type : ","Exclusive Owner",null,null,"Input : ",{"$f":"IFERROR(VLOOKUP($B$3,'Conn Information'!$A$2:$D$4,4,FALSE),\"\")","v":101},{"$f":"IF(COUNTIF($C$7:$C$69,\"OK\")=63,IFERROR(VLOOKUP($B$3,'Conn Information'!$A$8:$D$11,4,FALSE),\"\"),\"ERROR\")","v":8},{"$f":"IF(AND($B$3=\"Exclusive Owner\",G3>0),\"OK\",IF($B$3<>\"Exclusive Owner\",\"OK\",\"Output cannot be 0\"))","v":"OK"},"Chassis Size :",{"$f":"COUNTA(B6:B69)","v":1},"This chassis value is set to the XXX_C[4] & XXX_C[5] (where XXX is the Device name given) e.g value 4 is XXX_C[4]= 4 and XXX_C[5] = 0"]
[null,null,null,null,"Output :",{"$f":"IFERROR(VLOOKUP($B$3,'Conn Information'!$A$2:$D$4,3,FALSE),\"\")","v":100},{"$f":"IF(COUNTIF($C$7:$C$69,\"OK\")=63,IFERROR(VLOOKUP($B$3,'Conn Information'!$A$8:$D$11,3,FALSE),\"\"),\"ERROR\")","v":0},{"$f":"IF(AND($B$3=\"Exclusive Owner\",G4>0),\"OK\",IF($B$3<>\"Exclusive Owner\",\"OK\",\"Output cannot be 0 in Exclusive Owner\"))","v":"Output cannot be 0 in Exclusive Owner"}]
[null,"Catalog","Remarks",null,"Configuration :",{"$f":"IFERROR(VLOOKUP($B$3,'Conn Information'!$A$2:$D$4,2,FALSE),\"\")","v":102},{"$f":"IF(COUNTIF($C$7:$C$69,\"OK\")=63,IFERROR(VLOOKUP($B$3,'Conn Information'!$A$8:$D$11,2,FALSE),\"\"),\"ERROR\")","v":10},{"$f":"IF(AND($B$3=\"Exclusive Owner\",G5>0),\"OK\",IF($B$3<>\"Exclusive Owner\",\"OK\",\"Output cannot be 0\"))","v":"OK"}]
["Slot 0","1734-AENTR"]
["Slot 1",null,{"$f":"IF(AND($B$3='Conn Information'!$A$4,LEFT(Config!$B7,6)=\"1734-O\"),\"Invalid entry\",\"OK\")","v":"OK"}]
["Slot 2",null,{"$f":"IF(AND($B$3='Conn Information'!$A$4,LEFT(Config!$B8,6)=\"1734-O\"),\"Invalid entry\",\"OK\")","v":"OK"}]
["Slot 3",null,{"$f":"IF(AND($B$3='Conn Information'!$A$4,LEFT(Config!$B9,6)=\"1734-O\"),\"Invalid entry\",\"OK\")","v":"OK"}]
["Slot 4",null,{"$f":"IF(AND($B$3='Conn Information'!$A$4,LEFT(Config!$B10,6)=\"1734-O\"),\"Invalid entry\",\"OK\")","v":"OK"}]
["Slot 5",null,{"$f":"IF(AND($B$3='Conn Information'!$A$4,LEFT(Config!$B11,6)=\"1734-O\"),\"Invalid entry\",\"OK\")","v":"OK"}]
["Slot 6",null,{"$f":"IF(AND($B$3='Conn Information'!$A$4,LEFT(Config!$B12,6)=\"1734-O\"),\"Invalid entry\",\"OK\")","v":"OK"}]
["Slot 7",null,{"$f":"IF(AND($B$3='Conn Information'!$A$4,LEFT(Config!$B13,6)=\"1734-O\"),\"Invalid entry\",\"OK\")","v":"OK"}]
["Slot 8",null,{"$f":"IF(AND($B$3='Conn Information'!$A$4,LEFT(Config!$B14,6)=\"1734-O\"),\"Invalid entry\",\"OK\")","v":"OK"}]
["Slot 9",null,{"$f":"IF(AND($B$3='Conn Information'!$A$4,LEFT(Config!$B15,6)=\"1734-O\"),\"Invalid entry\",\"OK\")","v":"OK"}]
{"$rows_left_out":55}
{"sheet":"Tag Mapping","index":1,"n_rows":328,"n_cols":34,"rows_kept":328,"cut":false,"hidden":false,"merged":[[3,11,10,11],[3,0,12,0],[13,2,13,9],[14,2,14,9],[15,2,15,9],[3,12,10,12],[11,14,11,21],[12,14,12,21],[9,2,9,9],[10,2,10,9],[11,2,11,9],[12,2,12,9],[3,2,3,9],[4,2,4,9],[5,2,5,9],[6,2,6,9],[7,2,7,9],[8,2,8,9],[13,14,13,21],[14,14,14,21],[15,14,15,21],[16,2,16,9],[17,2,17,9],[13,0,17,0],[18,0,22,0],[18,2,18,9],[19,2,19,9],[20,2,20,9],[21,2,21,9],[22,2,22,9],[28,0,32,0],[28,2,28,9],[29,2,29,9],[30,2,30,9],[31,2,31,9],[32,2,32,9],[23,0,27,0],[23,2,23,9],[24,2,24,9],[25,2,25,9],[26,2,26,9],[27,2,27,9],[38,0,42,0],[38,2,38,9],[39,2,39,9],[40,2,40,9],[41,2,41,9],[42,2,42,9],[33,0,37,0],[33,2,33,9],[34,2,34,9],[35,2,35,9],[36,2,36,9],[37,2,37,9],[48,0,52,0],[48,2,48,9],[49,2,49,9],[50,2,50,9],[51,2,51,9],[52,2,52,9],[43,0,47,0],[43,2,43,9],[44,2,44,9],[45,2,45,9],[46,2,46,9],[47,2,47,9],[58,0,62,0],[58,2,58,9],[59,2,59,9],[60,2,60,9],[61,2,61,9],[62,2,62,9],[53,0,57,0],[53,2,53,9],[54,2,54,9],[55,2,55,9],[56,2,56,9],[57,2,57,9],[68,0,72,0],[68,2,68,9],[69,2,69,9],[70,2,70,9],[71,2,71,9],[72,2,72,9],[63,0,67,0],[63,2,63,9],[64,2,64,9],[65,2,65,9],[66,2,66,9],[67,2,67,9],[78,0,82,0],[78,2,78,9],[79,2,79,9],[80,2,80,9],[81,2,81,9],[82,2,82,9],[73,0,77,0],[73,2,73,9],[74,2,74,9],[75,2,75,9],[76,2,76,9],[77,2,77,9],[88,0,92,0],[88,2,88,9],[89,2,89,9],[90,2,90,9],[91,2,91,9],[92,2,92,9],[83,0,87,0],[83,2,83,9],[84,2,84,9],[85,2,85,9],[86,2,86,9],[87,2,87,9],[98,0,102,0],[98,2,98,9],[99,2,99,9],[100,2,100,9],[101,2,101,9],[102,2,102,9],[93,0,97,0],[93,2,93,9],[94,2,94,9],[95,2,95,9],[96,2,96,9],[97,2,97,9],[108,0,112,0],[108,2,108,9],[109,2,109,9],[110,2,110,9],[111,2,111,9],[112,2,112,9],[103,0,107,0],[103,2,103,9],[104,2,104,9],[105,2,105,9],[106,2,106,9],[107,2,107,9],[118,0,122,0],[118,2,118,9],[119,2,119,9],[120,2,120,9],[121,2,121,9],[122,2,122,9],[113,0,117,0],[113,2,113,9],[114,2,114,9],[115,2,115,9],[116,2,116,9],[117,2,117,9],[128,0,132,0],[128,2,128,9],[129,2,129,9],[130,2,130,9],[131,2,131,9],[132,2,132,9],[123,0,127,0],[123,2,123,9],[124,2,124,9],[125,2,125,9],[126,2,126,9],[127,2,127,9],[138,0,142,0],[138,2,138,9],[139,2,139,9],[140,2,140,9],[141,2,141,9],[142,2,142,9],[133,0,137,0],[133,2,133,9],[134,2,134,9],[135,2,135,9],[136,2,136,9],[137,2,137,9],[148,0,152,0],[148,2,148,9],[149,2,149,9],[150,2,150,9],[151,2,151,9],[152,2,152,9],[143,0,147,0],[143,2,143,9],[144,2,144,9],[145,2,145,9],[146,2,146,9],[147,2,147,9],[158,0,162,0],[158,2,158,9],[159,2,159,9],[160,2,160,9],[161,2,161,9],[162,2,162,9],[153,0,157,0],[153,2,153,9],[154,2,154,9],[155,2,155,9],[156,2,156,9],[157,2,157,9],[168,0,172,0],[168,2,168,9],[169,2,169,9],[170,2,170,9],[171,2,171,9],[172,2,172,9],[163,0,167,0],[163,2,163,9],[164,2,164,9],[165,2,165,9],[166,2,166,9],[167,2,167,9],[178,0,182,0],[178,2,178,9],[179,2,179,9],[180,2,180,9],[181,2,181,9],[182,2,182,9],[173,0,177,0],[173,2,173,9],[174,2,174,9],[175,2,175,9],[176,2,176,9],[177,2,177,9],[188,0,192,0],[188,2,188,9],[189,2,189,9],[190,2,190,9],[191,2,191,9],[192,2,192,9],[183,0,187,0],[183,2,183,9],[184,2,184,9],[185,2,185,9],[186,2,186,9],[187,2,187,9],[198,0,202,0],[198,2,198,9],[199,2,199,9],[200,2,200,9],[201,2,201,9],[202,2,202,9],[193,0,197,0],[193,2,193,9],[194,2,194,9],[195,2,195,9],[196,2,196,9],[197,2,197,9],[208,0,212,0],[208,2,208,9],[209,2,209,9],[210,2,210,9],[211,2,211,9],[212,2,212,9],[203,0,207,0],[203,2,203,9],[204,2,204,9],[205,2,205,9],[206,2,206,9],[207,2,207,9],[218,0,222,0],[218,2,218,9],[219,2,219,9],[220,2,220,9],[221,2,221,9],[222,2,222,9],[213,0,217,0],[213,2,213,9],[214,2,214,9],[215,2,215,9],[216,2,216,9],[217,2,217,9],[228,0,232,0],[228,2,228,9],[229,2,229,9],[230,2,230,9],[231,2,231,9],[232,2,232,9],[223,0,227,0],[223,2,223,9],[224,2,224,9],[225,2,225,9],[226,2,226,9],[227,2,227,9],[238,0,242,0],[238,2,238,9],[239,2,239,9],[240,2,240,9],[241,2,241,9],[242,2,242,9],[233,0,237,0],[233,2,233,9],[234,2,234,9],[235,2,235,9],[236,2,236,9],[237,2,237,9],[248,0,252,0],[248,2,248,9],[249,2,249,9],[250,2,250,9],[251,2,251,9],[252,2,252,9],[243,0,247,0],[243,2,243,9],[244,2,244,9],[245,2,245,9],[246,2,246,9],[247,2,247,9],[258,0,262,0],[258,2,258,9],[259,2,259,9],[260,2,260,9],[261,2,261,9],[262,2,262,9],[253,0,257,0],[253,2,253,9],[254,2,254,9],[255,2,255,9],[256,2,256,9],[257,2,257,9],[268,0,272,0],[268,2,268,9],[269,2,269,9],[270,2,270,9],[271,2,271,9],[272,2,272,9],[263,0,267,0],[263,2,263,9],[264,2,264,9],[265,2,265,9],[266,2,266,9],[267,2,267,9],[278,0,282,0],[278,2,278,9],[279,2,279,9],[280,2,280,9],[281,2,281,9],[282,2,282,9],[273,0,277,0],[273,2,273,9],[274,2,274,9],[275,2,275,9],[276,2,276,9],[277,2,277,9],[288,0,292,0],[288,2,288,9],[289,2,289,9],[290,2,290,9],[291,2,291,9],[292,2,292,9],[283,0,287,0],[283,2,283,9],[284,2,284,9],[285,2,285,9],[286,2,286,9],[287,2,287,9],[298,0,302,0],[298,2,298,9],[299,2,299,9],[300,2,300,9],[301,2,301,9],[302,2,302,9],[293,0,297,0],[293,2,293,9],[294,2,294,9],[295,2,295,9],[296,2,296,9],[297,2,297,9],[308,0,312,0],[308,2,308,9],[309,2,309,9],[310,2,310,9],[311,2,311,9],[312,2,312,9],[303,0,307,0],[303,2,303,9],[304,2,304,9],[305,2,305,9],[306,2,306,9],[307,2,307,9],[16,14,16,21],[17,14,17,21],[18,14,18,21],[323,0,327,0],[323,2,323,9],[324,2,324,9],[325,2,325,9],[326,2,326,9],[327,2,327,9],[318,0,322,0],[318,2,318,9],[319,2,319,9],[320,2,320,9],[321,2,321,9],[322,2,322,9],[313,0,317,0],[313,2,313,9],[314,2,314,9],[315,2,315,9],[316,2,316,9],[317,2,317,9],[25,14,25,21],[26,14,26,21],[27,14,27,21],[28,14,28,21],[29,14,29,21],[30,14,30,21],[19,14,19,21],[20,14,20,21],[21,14,21,21],[22,14,22,21],[23,14,23,21],[24,14,24,21],[37,14,37,21],[38,14,38,21],[39,14,39,21],[40,14,40,21],[41,14,41,21],[42,14,42,21],[31,14,31,21],[32,14,32,21],[33,14,33,21],[34,14,34,21],[35,14,35,21],[36,14,36,21],[49,14,49,21],[50,14,50,21],[51,14,51,21],[52,14,52,21],[53,14,53,21],[54,14,54,21],[43,14,43,21],[44,14,44,21],[45,14,45,21],[46,14,46,21],[47,14,47,21],[48,14,48,21],[63,14,63,21],[64,14,64,21],[65,14,65,21],[66,14,66,21],[55,14,55,21],[56,14,56,21],[57,14,57,21],[58,14,58,21],[59,14,59,21],[60,14,60,21],[12,26,12,33],[13,26,13,33],[14,26,14,33],[15,26,15,33],[16,26,16,33],[17,26,17,33],[73,14,73,21],[3,26,3,33],[4,26,4,33],[5,26,5,33],[6,26,6,33],[7,26,7,33],[8,26,8,33],[9,26,9,33],[10,26,10,33],[11,26,11,33],[67,14,67,21],[68,14,68,21],[69,14,69,21],[70,14,70,21],[71,14,71,21],[72,14,72,21],[61,14,61,21],[62,14,62,21],[24,26,24,33],[25,26,25,33],[26,26,26,33],[27,26,27,33],[28,26,28,33],[29,26,29,33],[18,26,18,33],[19,26,19,33],[20,26,20,33],[21,26,21,33],[22,26,22,33],[23,26,23,33],[36,26,36,33],[37,26,37,33],[38,26,38,33],[39,26,39,33],[40,26,40,33],[41,26,41,33],[30,26,30,33],[31,26,31,33],[32,26,32,33],[33,26,33,33],[34,26,34,33],[35,26,35,33],[48,26,48,33],[49,26,49,33],[50,26,50,33],[51,26,51,33],[52,26,52,33],[53,26,53,33],[42,26,42,33],[43,26,43,33],[44,26,44,33],[45,26,45,33],[46,26,46,33],[47,26,47,33],[60,26,60,33],[61,26,61,33],[62,26,62,33],[63,26,63,33],[64,26,64,33],[65,26,65,33],[54,26,54,33],[55,26,55,33],[56,26,56,33],[57,26,57,33],[58,26,58,33],[59,26,59,33]]}
["Config Assembly",null,null,null,null,null,null,null,null,null,null,"Input Assembly",null,null,null,null,null,null,null,null,null,null,null,"Output Assembly"]
[]
[null,"Byte","Bit 7","Bit 6","Bit 5","Bit 4","Bit 3","Bit 2","Bit 1","Bit 0",null,"Slot","Catalog","Byte","Bit 7","Bit 6","Bit 5","Bit 4","Bit 3","Bit 2","Bit 1","Bit 0",null,"Slot","Catalog","Byte","Bit 7","Bit 6","Bit 5","Bit 4","Bit 3","Bit 2","Bit 1","Bit 0"]
["Adapter",0,0,null,null,null,null,null,null,null,null,0,"Adapter",0,"Slot 7 Status","Slot 6 Status","Slot 5 Status","Slot 4 Status","Slot 3 Status","Slot 2 Status","Slot 1 Status","Slot 0 Status",null,1,{"$f":"Config!B7","v":0},{"$f":"IF(Y4=0,\"\",IF('Conn Information'!S3=0,\"\",IF('Conn Information'!S3=1,'Conn Information'!W3,('Conn Information'!W2+1)&\" to \"&'Conn Information'!W3)))","v":""},"See Assembly Database for respective breakdown of mapping"]
[null,1,0,null,null,null,null,null,null,null,null,null,null,1,"Slot 15 Status","Slot 14 Status","Slot 13 Status","Slot 12 Status","Slot 11 Status","Slot 10 Status","Slot 9 Status","Slot 8 Status",null,2,{"$f":"Config!B8","v":0},{"$f":"IF(Y5=0,\"\",IF('Conn Information'!S4=0,\"\",IF('Conn Information'!S4=1,'Conn Information'!W4,('Conn Information'!W3+1)&\" to \"&'Conn Information'!W4)))","v":""},"See Assembly Database for respective breakdown of mapping"]
[null,2,0,null,null,null,null,null,null,null,null,null,null,2,"Slot 23 Status","Slot 22 Status","Slot 21 Status","Slot 20 Status","Slot 19 Status","Slot 18 Status","Slot 17 Status","Slot 16 Status",null,3,{"$f":"Config!B9","v":0},{"$f":"IF(Y6=0,\"\",IF('Conn Information'!S5=0,\"\",IF('Conn Information'!S5=1,'Conn Information'!W5,('Conn Information'!W4+1)&\" to \"&'Conn Information'!W5)))","v":""},"See Assembly Database for respective breakdown of mapping"]
[null,3,0,null,null,null,null,null,null,null,null,null,null,3,"Slot 31 Status","Slot 30 Status","Slot 29 Status","Slot 28 Status","Slot 27 Status","Slot 26 Status","Slot 25 Status","Slot 24 Status",null,4,{"$f":"Config!B10","v":0},{"$f":"IF(Y7=0,\"\",IF('Conn Information'!S6=0,\"\",IF('Conn Information'!S6=1,'Conn Information'!W6,('Conn Information'!W5+1)&\" to \"&'Conn Information'!W6)))","v":""},"See Assembly Database for respective breakdown of mapping"]
[null,4,{"$f":"RIGHT(Config!$J$3,1)","v":"1"},null,null,null,null,null,null,null,null,null,null,4,"Slot 39 Status","Slot 38 Status","Slot 37 Status","Slot 36 Status","Slot 35 Status","Slot 34 Status","Slot 33 Status","Slot 32 Status",null,5,{"$f":"Config!B11","v":0},{"$f":"IF(Y8=0,\"\",IF('Conn Information'!S7=0,\"\",IF('Conn Information'!S7=1,'Conn Information'!W7,('Conn Information'!W6+1)&\" to \"&'Conn Information'!W7)))","v":""},"See Assembly Database for respective breakdown of mapping"]
[null,5,{"$f":"IF(LEFT(Config!$J$3,1)=RIGHT(Config!$J$3,1),0,LEFT(Config!$J$3,1))","v":0},null,null,null,null,null,null,null,null,null,null,5,"Slot 47 Status","Slot 46 Status","Slot 45 Status","Slot 44 Status","Slot 43 Status","Slot 42 Status","Slot 41 Status","Slot 40 Status",null,6,{"$f":"Config!B12","v":0},{"$f":"IF(Y9=0,\"\",IF('Conn Information'!S8=0,\"\",IF('Conn Information'!S8=1,'Conn Information'!W8,('Conn Information'!W7+1)&\" to \"&'Conn Information'!W8)))","v":""},"See Assembly Database for respective breakdown of mapping"]
[null,6,0,null,null,null,null,null,null,null,null,null,null,6,"Slot 55 Status","Slot 54 Status","Slot 53 Status","Slot 52 Status","Slot 51 Status","Slot 50 Status","Slot 49 Status","Slot 48 Status",null,7,{"$f":"Config!B13","v":0},{"$f":"IF(Y10=0,\"\",IF('Conn Information'!S9=0,\"\",IF('Conn Information'!S9=1,'Conn Information'!W9,('Conn Information'!W8+1)&\" to \"&'Conn Information'!W9)))","v":""},"See Assembly Database for respective breakdown of mapping"]
[null,7,0,null,null,null,null,null,null,null,null,null,null,7,"Slot 63 Status","Slot 62 Status","Slot 61 Status","Slot 60 Status","Slot 59 Status","Slot 58 Status","Slot 57 Status","Slot 56 Status",null,8,{"$f":"Config!B14","v":0},{"$f":"IF(Y11=0,\"\",IF('Conn Information'!S10=0,\"\",IF('Conn Information'!S10=1,'Conn Information'!W10,('Conn Information'!W9+1)&\" to \"&'Conn Information'!W10)))","v":""},"See Assembly Database for respective breakdown of mapping"]
[null,8,0,null,null,null,null,null,null,null,null,1,{"$f":"Config!B7","v":0},{"$f":"IF(M12=0,\"\",IF('Conn Information'!R3=0,\"\",IF('Conn Information'!R3=1,'Conn Information'!V3,('Conn Information'!V2+1)&\" to \"&'Conn Information'!V3)))","v":""},"See Assembly Database for respective breakdown of mapping",null,null,null,null,null,null,null,null,9,{"$f":"Config!B15","v":0},{"$f":"IF(Y12=0,\"\",IF('Conn Information'!S11=0,\"\",IF('Conn Information'!S11=1,'Conn Information'!W11,('Conn Information'!W10+1)&\" to \"&'Conn Information'!W11)))","v":""},"See Assembly Database for respective breakdown of mapping"]
[null,9,0,null,null,null,null,null,null,null,null,2,{"$f":"Config!B8","v":0},{"$f":"IF(M13=0,\"\",IF('Conn Information'!R4=0,\"\",IF('Conn Information'!R4=1,'Conn Information'!V4,('Conn Information'!V3+1)&\" to \"&'Conn Information'!V4)))","v":""},"See Assembly Database for respective breakdown of mapping",null,null,null,null,null,null,null,null,10,{"$f":"Config!B16","v":0},{"$f":"IF(Y13=0,\"\",IF('Conn Information'!S12=0,\"\",IF('Conn Information'!S12=1,'Conn Information'!W12,('Conn Information'!W11+1)&\" to \"&'Conn Information'!W12)))","v":""},"See Assembly Database for respective breakdown of mapping"]
[{"$f":"Config!B7","v":0},{"$f":"IF(A14=0,\"\",B13+1)","v":""},1,null,null,null,null,null,null,null,null,3,{"$f":"Config!B9","v":0},{"$f":"IF(M14=0,\"\",IF('Conn Information'!R5=0,\"\",IF('Conn Information'!R5=1,'Conn Information'!V5,('Conn Information'!V4+1)&\" to \"&'Conn Information'!V5)))","v":""},"See Assembly Database for respective breakdown of mapping",null,null,null,null,null,null,null,null,11,{"$f":"Config!B17","v":0},{"$f":"IF(Y14=0,\"\",IF('Conn Information'!S13=0,\"\",IF('Conn Information'!S13=1,'Conn Information'!W13,('Conn Information'!W12+1)&\" to \"&'Conn Information'!W13)))","v":""},"See Assembly Database for respective breakdown of mapping"]
[null,{"$f":"IF(A14=0,\"\",B14+1)","v":""},{"$f":"IF(A14=0,\"\",VLOOKUP($A14,'Conn Information'!$P$1:$T$65,2,FALSE))","v":""},null,null,null,null,null,null,null,null,4,{"$f":"Config!B10","v":0},{"$f":"IF(M15=0,\"\",IF('Conn Information'!R6=0,\"\",IF('Conn Information'!R6=1,'Conn Information'!V6,('Conn Information'!V5+1)&\" to \"&'Conn Information'!V6)))","v":""},"See Assembly Database for respective breakdown of mapping",null,null,null,null,null,null,null,null,12,{"$f":"Config!B18","v":0},{"$f":"IF(Y15=0,\"\",IF('Conn Information'!S14=0,\"\",IF('Conn Information'!S14=1,'Conn Information'!W14,('Conn Information'!W13+1)&\" to \"&'Conn Information'!W14)))","v":""},"See Assembly Database for respective breakdown of mapping"]
{"$rows_left_out":314}
{"sheet":"Assembly database","index":2,"n_rows":925,"n_cols":38,"rows_kept":925,"cut":false,"hidden":false,"merged":[]}
[]
[]
[]
[null,"Config",null,null,null,null,null,null,null,null,null,null,null,null,null,null,null,"Input",null,null,null,null,null,null,null,null,null,null,"Output"]
[]
["Filter","Catalog","Instance","Byte","Bit 7","Bit 6","Bit 5","Bit 4","Bit 3","Bit 2","Bit 1","Bit 0","Default values","Datatype","Default","Valid Data Values",null,"Catalog","Byte","Bit 7","Bit 6","Bit 5","Bit 4","Bit 3","Bit 2","Bit 1","Bit 0",null,"Catalog","Byte","Bit 7","Bit 6","Bit 5","Bit 4","Bit 3","Bit 2","Bit 1","Bit 0"]
[{"$f":"OR(IFERROR(MATCH(\"IB2\",'Conn Information'!$N$3:$N$65,0),0),IFERROR(MATCH(\"IV2\",'Conn Information'!$N$3:$N$65,0),0),IFERROR(MATCH(\"IA2\",'Conn Information'!$N$3:$N$65,0),0),IFERROR(MATCH(\"IM2\",'Conn Information'!$N$3:$N$65,0),0))","v":false},"IB2, IV2, IA2 or IM2",103,0,"Input 0 Off to On Filter Low Byte",null,null,null,null,null,null,null,"-24","INT",1000,"-32,768…32,767 µs (0…65,535)",null,"IB2, IV2, IA2 or IM2",0,"Reserved",null,null,null,null,null,"CH 1","CH 0"]
[{"$f":"OR(IFERROR(MATCH(\"IB2\",'Conn Information'!$N$3:$N$65,0),0),IFERROR(MATCH(\"IV2\",'Conn Information'!$N$3:$N$65,0),0),IFERROR(MATCH(\"IA2\",'Conn Information'!$N$3:$N$65,0),0),IFERROR(MATCH(\"IM2\",'Conn Information'!$N$3:$N$65,0),0))","v":false},"IB2, IV2, IA2 or IM2",null,1,"Input 0 Off to On Filter High Byte",null,null,null,null,null,null,null,3]
[{"$f":"OR(IFERROR(MATCH(\"IB2\",'Conn Information'!$N$3:$N$65,0),0),IFERROR(MATCH(\"IV2\",'Conn Information'!$N$3:$N$65,0),0),IFERROR(MATCH(\"IA2\",'Conn Information'!$N$3:$N$65,0),0),IFERROR(MATCH(\"IM2\",'Conn Information'!$N$3:$N$65,0),0))","v":false},"IB2, IV2, IA2 or IM2",null,2,"Input 0 On to Off Filter Low Byte",null,null,null,null,null,null,null,"-24","INT",1000,"-32,768…32,767 µs (0…65,535)"]
[{"$f":"OR(IFERROR(MATCH(\"IB2\",'Conn Information'!$N$3:$N$65,0),0),IFERROR(MATCH(\"IV2\",'Conn Information'!$N$3:$N$65,0),0),IFERROR(MATCH(\"IA2\",'Conn Information'!$N$3:$N$65,0),0),IFERROR(MATCH(\"IM2\",'Conn Information'!$N$3:$N$65,0),0))","v":false},"IB2, IV2, IA2 or IM2",null,3,"Input 0 On to Off Filter High Byte",null,null,null,null,null,null,null,3]
[{"$f":"OR(IFERROR(MATCH(\"IB2\",'Conn Information'!$N$3:$N$65,0),0),IFERROR(MATCH(\"IV2\",'Conn Information'!$N$3:$N$65,0),0),IFERROR(MATCH(\"IA2\",'Conn Information'!$N$3:$N$65,0),0),IFERROR(MATCH(\"IM2\",'Conn Information'!$N$3:$N$65,0),0))","v":false},"IB2, IV2, IA2 or IM2",null,4,"Input 1 Off to On Filter Low Byte",null,null,null,null,null,null,null,"-24","INT",1000,"-32,768…32,767 µs (0…65,535)"]
[{"$f":"OR(IFERROR(MATCH(\"IB2\",'Conn Information'!$N$3:$N$65,0),0),IFERROR(MATCH(\"IV2\",'Conn Information'!$N$3:$N$65,0),0),IFERROR(MATCH(\"IA2\",'Conn Information'!$N$3:$N$65,0),0),IFERROR(MATCH(\"IM2\",'Conn Information'!$N$3:$N$65,0),0))","v":false},"IB2, IV2, IA2 or IM2",null,5,"Input 1 Off to On Filter High Byte",null,null,null,null,null,null,null,3]
[{"$f":"OR(IFERROR(MATCH(\"IB2\",'Conn Information'!$N$3:$N$65,0),0),IFERROR(MATCH(\"IV2\",'Conn Information'!$N$3:$N$65,0),0),IFERROR(MATCH(\"IA2\",'Conn Information'!$N$3:$N$65,0),0),IFERROR(MATCH(\"IM2\",'Conn Information'!$N$3:$N$65,0),0))","v":false},"IB2, IV2, IA2 or IM2",null,6,"Input 1 On to Off Filter Low Byte",null,null,null,null,null,null,null,"-24","INT",1000,"-32,768…32,767 µs (0…65,535)"]
[{"$f":"OR(IFERROR(MATCH(\"IB2\",'Conn Information'!$N$3:$N$65,0),0),IFERROR(MATCH(\"IV2\",'Conn Information'!$N$3:$N$65,0),0),IFERROR(MATCH(\"IA2\",'Conn Information'!$N$3:$N$65,0),0),IFERROR(MATCH(\"IM2\",'Conn Information'!$N$3:$N$65,0),0))","v":false},"IB2, IV2, IA2 or IM2",null,7,"Input 1 On to Off Filter High Byte",null,null,null,null,null,null,null,3]
[{"$f":"OR(IFERROR(MATCH(\"IB4\",'Conn Information'!$N$3:$N$65,0),0),IFERROR(MATCH(\"IV4\",'Conn Information'!$N$3:$N$65,0),0),IFERROR(MATCH(\"IA4\",'Conn Information'!$N$3:$N$65,0),0),IFERROR(MATCH(\"IM4\",'Conn Information'!$N$3:$N$65,0),0))","v":false},"IB4, IV4, IA4 or IM4",103,0,"Input 0 Off to On Filter Low Byte",null,null,null,null,null,null,null,"-24","INT",1000,"-32,768…32,767 µs (0…65,535)",null,"IB4, IV4, IA4 or IM4",0,"Reserved",null,null,null,"CH 3","CH 2","CH 1","CH 0"]
{"$rows_left_out":911}
{"sheet":"Revision","index":3,"n_rows":2,"n_cols":2,"rows_kept":2,"cut":false,"hidden":false,"merged":[]}
["Revision Number","Changes"]
[1,"Generic Device Configurator creation"]

{"sheet":"Conn Information","index":4,"n_rows":65,"n_cols":24,"rows_kept":65,"cut":false,"hidden":true,"merged":[]}
["Connection Type","Configuration","Output","Input",null,null,"Catalog","Config instance","Config Size","Input size","Output size1","Output size2","Output size3",null,"Slot","Catalog","Config","Input","Output","Instance","Total Config","Total Input","Total Output"]
["Exclusive Owner",102,100,101,null,null,"1734-AENTR",102,10,8,0,null,null,null,0,"1734-AENTR",10,8,0,null,10,7,0]
["Listen only",102,191,101,null,null,"1734-IB2",103,8,1,0,null,null,{"$f":"IFERROR(MID(P3,6,LEN(P3)-5),0)","v":0},1,{"$f":"Config!B7","v":0},{"$f":"IFERROR(VLOOKUP($P3,$G$1:$M$47,3,FALSE),)","v":0},{"$f":"IFERROR(VLOOKUP($P3,$G$1:$M$47,4,FALSE),)","v":0},{"$f":"IFERROR(VLOOKUP($P3,$G$1:$M$47,5,FALSE),)","v":0},{"$f":"IFERROR(VLOOKUP($P3,$G$1:$M$47,2,FALSE),)","v":0},{"$f":"IF(P3=0,\"\",IF(P3=\"1734-ARM\",Q3+U2,Q3+U2+4))","v":""},{"$f":"R3+V2","v":7},{"$f":"IF($S3=0,$W2,IF(X3=0,$S3-1,$S3+$W2))","v":0},{"$f":"IF(S3=0,0,1)","v":0}]
["Input only",102,190,101,null,null,"1734-IB4",103,16,1,0,null,null,{"$f":"IFERROR(MID(P4,6,LEN(P4)-5),0)","v":0},2,{"$f":"Config!B8","v":0},0,0,0,{"$f":"IFERROR(VLOOKUP($P4,$G$1:$M$47,2,FALSE),)","v":0},{"$f":"IF(P4=0,\"\",IF(P4=\"1734-ARM\",Q4+U3,Q4+U3+4))","v":""},{"$f":"R4+V3","v":7},{"$f":"IF($S4=0,$W3,IF(X3=0,$S4-1,$S4+$W3))","v":0},{"$f":"IF(S4=0,X3,1)","v":0}]
[null,null,null,null,null,null,"1734-IB4D",103,18,2,0,null,null,0,3,{"$f":"Config!B9","v":0},0,0,0,0,{"$f":"IF(P5=0,\"\",IF(P5=\"1734-ARM\",Q5+U4,Q5+U4+4))","v":""},7,0,0]
[null,null,null,null,null,null,"1734-IB8",103,32,1,0,null,null,0,4,{"$f":"Config!B10","v":0},0,0,0,0,"",7,0,0]
[null,null,null,null,null,null,"1734-IV2",103,8,1,0,null,null,0,5,{"$f":"Config!B11","v":0},0,0,0,0,"",7,0,0]
[null,"Configuration","Output","Input",null,null,"1734-IV4",103,16,1,0,null,null,0,6,{"$f":"Config!B12","v":0},0,0,0,0,"",7,0,0]
["Exclusive Owner",{"$f":"SUM($Q$2:$Q$65)+COUNTA(Config!$B$7:$B$69)*4","v":10},{"$f":"SUM(S2:S65)","v":0},{"$f":"SUM(R2:R65)","v":8},null,null,"1734-IV8",103,32,1,0,null,null,0,7,{"$f":"Config!B13","v":0},0,0,0,0,"",7,0,0]
["Listen Only",0,0,{"$f":"SUM(R2:R65)","v":8},null,null,"1734-OB2E",123,8,1,1,null,null,0,8,{"$f":"Config!B14","v":0},0,0,0,0,"",7,0,0]
["Input Only",{"$f":"SUM($Q$2:$Q$65)+COUNTA(Config!$B$7:$B$69)*4","v":10},0,{"$f":"SUM(R2:R65)","v":8},null,null,"1734-OB4E",123,8,1,1,null,null,0,9,{"$f":"Config!B15","v":0},0,0,0,0,"",7,0,0]
[null,null,null,null,null,null,"1734-OB2",123,8,1,1,null,null,0,10,{"$f":"Config!B16","v":0},0,0,0,0,"",7,0,0]
[null,null,null,null,null,null,"1734-OB4",123,8,1,1,null,null,0,11,{"$f":"Config!B17","v":0},0,0,0,0,"",7,0,0]
[null,null,null,null,null,null,"1734-OB8",123,8,1,1,null,null,0,12,{"$f":"Config!B18","v":0},0,0,0,0,"",7,0,0]
["Connection Type","Comm Format",null,null,null,null,"1734-OB8E",123,8,1,1,null,null,0,13,{"$f":"Config!B19","v":0},0,0,0,0,"",7,0,0]
{"$rows_left_out":50}